[aMsn 0.95] Installation impossible ?

Résolu
Bonjour,

Je n'arrive pas à installer aMsn 0.95 sous Linux Mandriva 2006 ?

Voici les instructions

=> Création du répertoire aMsn-0.95 dans /usr/local/

=> Décompression du programme

=> installation en mode console en tant que root :
[root@localhost aMsn_0.95]# ./configure
checking for gcc... gcc
checking for C compiler default output file name... a.out
checking whether the C compiler works... yes
checking whether we are cross compiling... no
checking for suffix of executables...
checking for suffix of object files... o
checking whether we are using the GNU C compiler... yes
checking whether gcc accepts -g... yes
checking for gcc option to accept ANSI C... none needed
checking for g++... g++
checking whether we are using the GNU C++ compiler... yes
checking whether g++ accepts -g... yes
checking how to run the C preprocessor... gcc -E
checking for prefix by checking for wish... no
checking tcl build dir... warning: locate: could not open database: /var/lib/slocate/slocate.db: No such file or directory
warning: You need to run the 'updatedb' command (as root) to create the database.
using tcl library in /usr/lib
checking tk build dir... warning: locate: could not open database: /var/lib/slocate/slocate.db: No such file or directory
warning: You need to run the 'updatedb' command (as root) to create the database.
configure: error: Unable to find Tk directory or Tk package is not tk-dev
[root@localhost aMsn_0.95]#   


Comment résoudre le problème pour installer aMsn ?

--
L'Open source et Linux sont l'avenir de l'informatique ;-)

6 réponses

  1. Contributeur
    Bonjour,

    J'ai trouvé le problème est d'installer le paquetage TK .
    Donc le problème est résolu,

    Procédure classique pour l'installation.
    1. Modérateur
      Salut,

      configure: error: Unable to find Tk directory or Tk package is not tk-dev

      Félicitations!

      Donc le problème est résolu, En ce cas il te reste quand même une chose à faire. Marque ton poste comme Problème résolu


      lami20j
      1. Contributeur
        Salut lami et arno,

        Lami, tu sais que en tant que contributeur, tu peux marquer le post d'arno comme résolut! Y a un encart en haut, entre les autres post concernant ce sujet, et le post actuel.

        D'auilleur, là, c'est moi qui marque le sujet résolut!

        Renisaac
        1. Modérateur
          Salut,

          tu sais que en tant que contributeur, tu peux marquer le post d'arno comme résolut

          oui j'ai remarqué, la prochaine fois je le ferai. Merci.

          lami20j
      2. Contributeur
        Bonjour,

        Il m'est impossible d'installer la version aMsn 0.96 RC, même problème:

        - Paquetage Tcl & Tk sont bien installés.

        en mode root:
        [root@localhost aMsn_0.96RC1]#ls -a
        ./                config.tcl          HELP            plugins.tcl
        ../               configure*          hotmail.tcl     preferences.tcl
        abook.tcl         configure.ac        hotmlog.htm     progressbar.tcl
        AGREEMENT         console.tcl         icons/          protocol.tcl
        alarm.tcl         contactlist.tcl     INSTALL         proxy.tcl
        amsn*             CREDITS             lang/           README
        amsn.debianmenu   ctadverts.tcl       langlist        remote.help
        amsn.desktop      ctthemes.tcl        lang.tcl        remote.tcl
        amsn-remote*      cvs_date            loging.tcl      searchdialog.tcl
        amsn-remote-CLI*  debian/             Makefile.in     skins/
        amsn.spec         debug.tcl           migmd5.tcl      skins.tcl
        AppMain.tcl*      des.tcl             msncam.tcl      smileys.tcl
        automsg.tcl       dock.tcl            msnp13.tcl      sndplay*
        autopackage/      docs/               msnp2p.tcl      socks.tcl
        autoupdate.tcl    FAQ                 mutex.tcl       sxml.tcl
        balloon.tcl       GNUGPL              notes.tcl       TODO
        bugs.tcl          groups.tcl          picture.tcl     trayicon.tcl
        chatwindow.tcl    guicontactlist.tcl  plugins/        utils/
        Compile.mk        gui.tcl             pluginslog.tcl


        ./configure
        checking for prefix by checking for wish... /usr/bin/wish
        checking for gcc... gcc
        checking for C compiler default output file name... a.out
        checking whether the C compiler works... yes
        checking whether we are cross compiling... no
        checking for suffix of executables...
        checking for suffix of object files... o
        checking whether we are using the GNU C compiler... yes
        checking whether gcc accepts -g... yes
        checking for gcc option to accept ANSI C... none needed
        checking for g++... g++
        checking whether we are using the GNU C++ compiler... yes
        checking whether g++ accepts -g... yes
        checking tcl build dir... warning: locate: could not open database: /var/lib/slocate/slocate.db: No such file or directory
        warning: You need to run the 'updatedb' command (as root) to create the database.
        using tcl library in /usr/lib
        checking tk build dir... using tk library in /usr/lib
        checking for main in -lstdc++... yes
        checking how to run the C preprocessor... gcc -E
        checking for X... no
        "Could not find X11 devel package
        checking for ftello... yes
        checking for fseeko... yes
        checking for getpt... yes
        checking for strcasestr... yes
        checking for memmem... yes
        checking for dlopen... no
        checking for pthread_create in -lpthread... yes
        checking if mmx should be used... yes
        configure: creating ./config.status
        config.status: creating Makefile
        config.status: creating utils/linux/capture/config.h
        
        compile time options summary
        ============================
        
            X11          : no
            Tcl          : 8.4
            TK           : 8.4
            DEBUG        : no
            STATIC       : no
        


        make
          CXX     utils/TkCximage/src/TkCximage.cpp.o
        In file included from utils/TkCximage/src/TkCximage.h:21,
                         from utils/TkCximage/src/TkCximage.cpp:11:
        /usr/include/tk.h:96:23: error: X11/Xlib.h: Aucun fichier ou répertoire de ce type
        /usr/include/tk.h:572: error: typedef 'Window' is initialized (use __typeof__ instead)
        /usr/include/tk.h:572: error: 'Tk_ClassCreateProc' was not declared in this scope
        /usr/include/tk.h:572: error: expected ',' or ';' before '(' token
        /usr/include/tk.h:575: error: 'XEvent' has not been declared
        /usr/include/tk.h:584: error: expected ';' before '*' token
        /usr/include/tk.h:678: error: 'Bool' does not name a type
        /usr/include/tk.h:679: error: expected ';' before '*' token
        /usr/include/tk.h:683: error: 'Time' does not name a type
        /usr/include/tk.h:688: error: 'Bool' does not name a type
        /usr/include/tk.h:694: error: 'Bool' does not name a type
        /usr/include/tk.h:695: error: expected ';' before '*' token
        /usr/include/tk.h:771: error: expected ';' before '*' token
        /usr/include/tk.h:774: error: expected ';' before '*' token
        /usr/include/tk.h:785: error: 'XWindowChanges' does not name a type
        /usr/include/tk.h:787: error: 'XSetWindowAttributes' does not name a type
        /usr/include/tk.h:921: error: 'XPoint' has not been declared
        /usr/include/tk.h:1022: error: 'Display' has not been declared
        /usr/include/tk.h:1024: error: 'Display' has not been declared
        /usr/include/tk.h:1024: error: 'Drawable' has not been declared
        /usr/include/tk.h:1121: error: expected ';' before '*' token
        /usr/include/tk.h:1185: error: 'GC' does not name a type
        /usr/include/tk.h:1197: error: expected ';' before '*' token
        /usr/include/tk.h:1198: error: expected ';' before '*' token
        /usr/include/tk.h:1199: error: expected ';' before '*' token
        /usr/include/tk.h:1200: error: 'Pixmap' does not name a type
        /usr/include/tk.h:1201: error: 'Pixmap' does not name a type
        /usr/include/tk.h:1202: error: 'Pixmap' does not name a type
        /usr/include/tk.h:1226: error: 'Display' has not been declared
        /usr/include/tk.h:1226: error: 'Drawable' has not been declared
        /usr/include/tk.h:1229: error: 'Display' has not been declared
        /usr/include/tk.h:1434: error: 'Drawable' has not been declared
        /usr/include/tk.h:1551: error: 'XErrorEvent' has not been declared
        /usr/include/tk.h:1553: error: 'XEvent' has not been declared
        /usr/include/tk.h:1555: error: 'XEvent' has not been declared
        /usr/include/tk.h:1557: error: 'XEvent' has not been declared
        /usr/include/tk.h:1562: error: 'XEvent' has not been declared
        /usr/include/tkDecls.h:37: error: expected constructor, destructor, or type conversion before '*' token
        /usr/include/tkDecls.h:39: error: 'GC' does not name a type
        /usr/include/tkDecls.h:42: error: 'Drawable' has not been declared
        /usr/include/tkDecls.h:47: error: 'Drawable' has not been declared
        /usr/include/tkDecls.h:56: error: 'XEvent' has not been declared
        /usr/include/tkDecls.h:76: error: 'Pixmap' has not been declared
        /usr/include/tkDecls.h:80: error: 'XColor' has not been declared
        /usr/include/tkDecls.h:90: error: 'Pixmap' has not been declared
        /usr/include/tkDecls.h:95: error: 'GC' has not been declared
        /usr/include/tkDecls.h:114: error: 'XSetWindowAttributes' has not been declared
        /usr/include/tkDecls.h:122: error: 'Atom' has not been declared
        /usr/include/tkDecls.h:125: error: 'Atom' has not been declared
        /usr/include/tkDecls.h:125: error: 'Atom' has not been declared
        /usr/include/tkDecls.h:147: error: 'XWindowChanges' has not been declared
        /usr/include/tkDecls.h:167: error: 'Display' was not declared in this scope
        /usr/include/tkDecls.h:167: error: 'display' was not declared in this scope
        /usr/include/tkDecls.h:167: error: expected primary-expression before 'int'
        /usr/include/tkDecls.h:167: error: expected primary-expression before 'int'
        /usr/include/tkDecls.h:167: error: expected primary-expression before 'int'
        /usr/include/tkDecls.h:167: error: expected primary-expression before '*' token
        /usr/include/tkDecls.h:167: error: 'errorProc' was not declared in this scope
        /usr/include/tkDecls.h:167: error: expected primary-expression before 'clientData'
        /usr/include/tkDecls.h:167: error: initializer expression list treated as compound expression
        /usr/include/tkDecls.h:187: error: 'Atom' has not been declared
        /usr/include/tkDecls.h:187: error: 'Atom' has not been declared
        /usr/include/tkDecls.h:187: error: 'Atom' has not been declared
        /usr/include/tkDecls.h:232: error: 'Atom' has not been declared
        /usr/include/tkDecls.h:232: error: 'Atom' has not been declared
        /usr/include/tkDecls.h:242: error: 'Drawable' has not been declared
        /usr/include/tkDecls.h:242: error: 'XPoint' has not been declared
        /usr/include/tkDecls.h:247: error: 'Drawable' has not been declared
        /usr/include/tkDecls.h:252: error: variable or field 'Tk_DrawChars' declared void
        /usr/include/tkDecls.h:252: error: 'Display' was not declared in this scope
        /usr/include/tkDecls.h:252: error: 'display' was not declared in this scope
        /usr/include/tkDecls.h:252: error: 'Drawable' was not declared in this scope
        /usr/include/tkDecls.h:252: error: 'GC' was not declared in this scope
        /usr/include/tkDecls.h:252: error: expected primary-expression before 'tkfont'
        /usr/include/tkDecls.h:252: error: expected primary-expression before 'const'
        /usr/include/tkDecls.h:252: error: expected primary-expression before 'int'
        /usr/include/tkDecls.h:252: error: expected primary-expression before 'int'
        /usr/include/tkDecls.h:252: error: expected primary-expression before 'int'
        /usr/include/tkDecls.h:252: error: initializer expression list treated as compound expression
        /usr/include/tkDecls.h:257: error: 'GC' has not been declared
        /usr/include/tkDecls.h:257: error: 'Drawable' has not been declared
        /usr/include/tkDecls.h:260: error: variable or field 'Tk_DrawTextLayout' declared void
        /usr/include/tkDecls.h:260: error: 'Display' was not declared in this scope
        /usr/include/tkDecls.h:260: error: 'display' was not declared in this scope
        /usr/include/tkDecls.h:260: error: 'Drawable' was not declared in this scope
        /usr/include/tkDecls.h:260: error: 'GC' was not declared in this scope
        /usr/include/tkDecls.h:260: error: expected primary-expression before 'layout'
        /usr/include/tkDecls.h:260: error: expected primary-expression before 'int'
        /usr/include/tkDecls.h:260: error: expected primary-expression before 'int'
        /usr/include/tkDecls.h:260: error: expected primary-expression before 'int'
        /usr/include/tkDecls.h:260: error: expected primary-expression before 'int'
        /usr/include/tkDecls.h:260: error: initializer expression list treated as compound expression
        /usr/include/tkDecls.h:265: error: 'Drawable' has not been declared
        /usr/include/tkDecls.h:265: error: 'XPoint' has not been declared
        /usr/include/tkDecls.h:270: error: 'Drawable' has not been declared
        /usr/include/tkDecls.h:278: error: 'Font' does not name a type
        /usr/include/tkDecls.h:282: error: variable or field 'Tk_FreeBitmap' declared void
        /usr/include/tkDecls.h:282: error: 'Display' was not declared in this scope
        /usr/include/tkDecls.h:282: error: 'display' was not declared in this scope
        /usr/include/tkDecls.h:282: error: 'Pixmap' was not declared in this scope
        /usr/include/tkDecls.h:282: error: initializer expression list treated as compound expression
        /usr/include/tkDecls.h:285: error: variable or field 'Tk_FreeColor' declared void
        /usr/include/tkDecls.h:285: error: 'XColor' was not declared in this scope
        /usr/include/tkDecls.h:285: error: 'colorPtr' was not declared in this scope
        /usr/include/tkDecls.h:287: error: variable or field 'Tk_FreeColormap' declared void
        /usr/include/tkDecls.h:287: error: 'Display' was not declared in this scope
        /usr/include/tkDecls.h:287: error: 'display' was not declared in this scope
        /usr/include/tkDecls.h:287: error: 'Colormap' was not declared in this scope
        /usr/include/tkDecls.h:287: error: initializer expression list treated as compound expression
        /usr/include/tkDecls.h:290: error: variable or field 'Tk_FreeCursor' declared void
        /usr/include/tkDecls.h:290: error: 'Display' was not declared in this scope
        /usr/include/tkDecls.h:290: error: 'display' was not declared in this scope
        /usr/include/tkDecls.h:290: error: expected primary-expression before 'cursor'
        /usr/include/tkDecls.h:290: error: initializer expression list treated as compound expression
        /usr/include/tkDecls.h:295: error: variable or field 'Tk_FreeGC' declared void
        /usr/include/tkDecls.h:295: error: 'Display' was not declared in this scope
        /usr/include/tkDecls.h:295: error: 'display' was not declared in this scope
        /usr/include/tkDecls.h:295: error: 'GC' was not declared in this scope
        /usr/include/tkDecls.h:295: error: initializer expression list treated as compound expression
        /usr/include/tkDecls.h:299: error: 'Display' has not been declared
        /usr/include/tkDecls.h:303: error: variable or field 'Tk_FreePixmap' declared void
        /usr/include/tkDecls.h:303: error: 'Display' was not declared in this scope
        /usr/include/tkDecls.h:303: error: 'display' was not declared in this scope
        /usr/include/tkDecls.h:303: error: 'Pixmap' was not declared in this scope
        /usr/include/tkDecls.h:303: error: initializer expression list treated as compound expression
        /usr/include/tkDecls.h:309: error: variable or field 'Tk_FreeXId' declared void
        /usr/include/tkDecls.h:309: error: 'Display' was not declared in this scope
        /usr/include/tkDecls.h:309: error: 'display' was not declared in this scope
        /usr/include/tkDecls.h:309: error: 'XID' was not declared in this scope
        /usr/include/tkDecls.h:309: error: initializer expression list treated as compound expression
        /usr/include/tkDecls.h:311: error: 'GC' does not name a type
        /usr/include/tkDecls.h:327: error: 'Atom' has not been declared
        /usr/include/tkDecls.h:334: error: 'Pixmap' does not name a type
        /usr/include/tkDecls.h:337: error: 'Pixmap' does not name a type
        /usr/include/tkDecls.h:344: error: expected constructor, destructor, or type conversion before '*' token
        /usr/include/tkDecls.h:347: error: expected constructor, destructor, or type conversion before '*' token
        /usr/include/tkDecls.h:350: error: 'Colormap' does not name a type
        /usr/include/tkDecls.h:371: error: 'GC' does not name a type
        /usr/include/tkDecls.h:401: error: 'Pixmap' does not name a type
        /usr/include/tkDecls.h:418: error: 'Atom' has not been declared
        /usr/include/tkDecls.h:418: error: 'Atom' has not been declared
        /usr/include/tkDecls.h:424: error: expected constructor, destructor, or type conversion before '*' token
        /usr/include/tkDecls.h:435: error: variable or field 'Tk_HandleEvent' declared void
        /usr/include/tkDecls.h:435: error: 'XEvent' was not declared in this scope
        /usr/include/tkDecls.h:435: error: 'eventPtr' was not declared in this scope
        /usr/include/tkDecls.h:437: error: 'Display' was not declared in this scope
        /usr/include/tkDecls.h:437: error: 'display' was not declared in this scope
        /usr/include/tkDecls.h:437: error: expected primary-expression before 'window'
        /usr/include/tkDecls.h:437: error: initializer expression list treated as compound expression
        /usr/include/tkDecls.h:446: error: 'Atom' does not name a type
        /usr/include/tkDecls.h:484: error: 'Display' was not declared in this scope
        /usr/include/tkDecls.h:484: error: 'display' was not declared in this scope
        /usr/include/tkDecls.h:484: error: 'Pixmap' was not declared in this scope
        /usr/include/tkDecls.h:484: error: initializer expression list treated as compound expression
        /usr/include/tkDecls.h:489: error: 'XColor' was not declared in this scope
        /usr/include/tkDecls.h:489: error: 'colorPtr' was not declared in this scope
        /usr/include/tkDecls.h:491: error: 'Display' was not declared in this scope
        /usr/include/tkDecls.h:491: error: 'display' was not declared in this scope
        /usr/include/tkDecls.h:491: error: expected primary-expression before 'cursor'
        /usr/include/tkDecls.h:491: error: initializer expression list treated as compound expression
        /usr/include/tkDecls.h:509: error: 'Atom' has not been declared
        /usr/include/tkDecls.h:549: error: variable or field 'Tk_PreserveColormap' declared void
        /usr/include/tkDecls.h:549: error: 'Display' was not declared in this scope
        /usr/include/tkDecls.h:549: error: 'display' was not declared in this scope
        /usr/include/tkDecls.h:549: error: 'Colormap' was not declared in this scope
        /usr/include/tkDecls.h:549: error: initializer expression list treated as compound expression
        /usr/include/tkDecls.h:552: error: variable or field 'Tk_QueueWindowEvent' declared void
        /usr/include/tkDecls.h:552: error: 'XEvent' was not declared in this scope
        /usr/include/tkDecls.h:552: error: 'eventPtr' was not declared in this scope
        /usr/include/tkDecls.h:552: error: expected primary-expression before 'position'
        /usr/include/tkDecls.h:552: error: initializer expression list treated as compound expression
        /usr/include/tkDecls.h:555: error: 'Drawable' has not been declared
        /usr/include/tkDecls.h:591: error: 'Pixmap' has not been declared
        /usr/include/tkDecls.h:600: error: 'Pixmap' has not been declared
        /usr/include/tkDecls.h:603: error: 'Colormap' has not been declared
        /usr/include/tkDecls.h:606: error: 'Visual' has not been declared
        /usr/include/tkDecls.h:606: error: 'Colormap' has not been declared
        /usr/include/tkDecls.h:610: error: variable or field 'Tk_SizeOfBitmap' declared void
        /usr/include/tkDecls.h:610: error: 'Display' was not declared in this scope
        /usr/include/tkDecls.h:610: error: 'display' was not declared in this scope
        /usr/include/tkDecls.h:610: error: 'Pixmap' was not declared in this scope
        /usr/include/tkDecls.h:610: error: expected primary-expression before 'int'
        /usr/include/tkDecls.h:610: error: expected primary-expression before 'int'
        /usr/include/tkDecls.h:610: error: initializer expression list treated as compound expression
        /usr/include/tkDecls.h:627: error: variable or field 'Tk_UnderlineChars' declared void
        /usr/include/tkDecls.h:627: error: 'Display' was not declared in this scope
        /usr/include/tkDecls.h:627: error: 'display' was not declared in this scope
        /usr/include/tkDecls.h:627: error: 'Drawable' was not declared in this scope
        /usr/include/tkDecls.h:627: error: 'GC' was not declared in this scope
        /usr/include/tkDecls.h:627: error: expected primary-expression before 'tkfont'
        /usr/include/tkDecls.h:627: error: expected primary-expression before 'const'
        /usr/include/tkDecls.h:627: error: expected primary-expression before 'int'
        /usr/include/tkDecls.h:627: error: expected primary-expression before 'int'
        /usr/include/tkDecls.h:627: error: expected primary-expression before 'int'
        /usr/include/tkDecls.h:627: error: expected primary-expression before 'int'
        /usr/include/tkDecls.h:627: error: initializer expression list treated as compound expression
        /usr/include/tkDecls.h:632: error: variable or field 'Tk_UnderlineTextLayout' declared void
        /usr/include/tkDecls.h:632: error: 'Display' was not declared in this scope
        /usr/include/tkDecls.h:632: error: 'display' was not declared in this scope
        /usr/include/tkDecls.h:632: error: 'Drawable' was not declared in this scope
        /usr/include/tkDecls.h:632: error: 'GC' was not declared in this scope
        /usr/include/tkDecls.h:632: error: expected primary-expression before 'layout'
        /usr/include/tkDecls.h:632: error: expected primary-expression before 'int'
        /usr/include/tkDecls.h:632: error: expected primary-expression before 'int'
        /usr/include/tkDecls.h:632: error: expected primary-expression before 'int'
        /usr/include/tkDecls.h:632: error: initializer expression list treated as compound expression
        /usr/include/tkDecls.h:649: error: 'Pixmap' does not name a type
        /usr/include/tkDecls.h:657: error: expected constructor, destructor, or type conversion before '*' token
        /usr/include/tkDecls.h:702: error: 'Pixmap' does not name a type
        /usr/include/tkDecls.h:705: error: expected constructor, destructor, or type conversion before '*' token
        /usr/include/tkDecls.h:772: error: variable or field 'Tk_DeleteOutline' declared void
        /usr/include/tkDecls.h:772: error: 'Display' was not declared in this scope
        /usr/include/tkDecls.h:772: error: 'display' was not declared in this scope
        /usr/include/tkDecls.h:772: error: expected primary-expression before '*' token
        /usr/include/tkDecls.h:772: error: 'outline' was not declared in this scope
        /usr/include/tkDecls.h:772: error: initializer expression list treated as compound expression
        /usr/include/tkDecls.h:775: error: 'XGCValues' was not declared in this scope
        /usr/include/tkDecls.h:775: error: 'gcValues' was not declared in this scope
        /usr/include/tkDecls.h:775: error: expected primary-expression before 'canvas'
        /usr/include/tkDecls.h:775: error: expected primary-expression before '*' token
        /usr/include/tkDecls.h:775: error: 'item' was not declared in this scope
        /usr/include/tkDecls.h:775: error: expected primary-expression before '*' token
        /usr/include/tkDecls.h:775: error: 'outline' was not declared in this scope
        /usr/include/tkDecls.h:775: error: initializer expression list treated as compound expression
        /usr/include/tkDecls.h:788: error: 'GC' has not been declared
        /usr/include/tkDecls.h:795: error: 'GC' has not been declared
        /usr/include/tkDecls.h:801: error: 'Pixmap' has not been declared
        /usr/include/tkDecls.h:806: error: 'XColor' has not been declared
        /usr/include/tkDecls.h:821: error: 'Pixmap' has not been declared
        /usr/include/tkDecls.h:866: error: 'Display' was not declared in this scope
        /usr/include/tkDecls.h:866: error: 'display' was not declared in this scope
        /usr/include/tkDecls.h:866: error: expected primary-expression before 'int'
        /usr/include/tkDecls.h:866: error: initializer expression list treated as compound expression
        /usr/include/tkDecls.h:915: error: 'Drawable' has not been declared
        /usr/include/tkDecls.h:932: error: expected ';' before '*' token
        /usr/include/tkDecls.h:933: error: expected identifier before '*' token
        /usr/include/tkDecls.h:933: error: 'GC' declared as function returning a function
        /usr/include/tkDecls.h:934: error: 'Drawable' has not been declared
        /usr/include/tkDecls.h:935: error: 'Drawable' has not been declared
        /usr/include/tkDecls.h:937: error: 'XEvent' has not been declared
        /usr/include/tkDecls.h:942: error: 'Pixmap' has not been declared
        /usr/include/tkDecls.h:943: error: 'XColor' has not been declared
        /usr/include/tkDecls.h:946: error: 'Pixmap' has not been declared
        /usr/include/tkDecls.h:948: error: 'GC' is not a type
        /usr/include/tkDecls.h:953: error: 'XSetWindowAttributes' has not been declared
        /usr/include/tkDecls.h:955: error: 'Atom' has not been declared
        /usr/include/tkDecls.h:956: error: 'Atom' has not been declared
        /usr/include/tkDecls.h:956: error: 'Atom' has not been declared
        /usr/include/tkDecls.h:961: error: 'XWindowChanges' has not been declared
        /usr/include/tkDecls.h:966: error: 'Display' has not been declared
        /usr/include/tkDecls.h:972: error: 'Atom' has not been declared
        /usr/include/tkDecls.h:972: error: 'Atom' has not been declared
        /usr/include/tkDecls.h:972: error: 'Atom' has not been declared
        /usr/include/tkDecls.h:984: error: 'Atom' has not been declared
        /usr/include/tkDecls.h:984: error: 'Atom' has not been declared
        /usr/include/tkDecls.h:988: error: 'Drawable' has not been declared
        /usr/include/tkDecls.h:988: error: 'XPoint' has not been declared
        /usr/include/tkDecls.h:989: error: 'Drawable' has not been declared
        /usr/include/tkDecls.h:990: error: 'Display' has not been declared
        /usr/include/tkDecls.h:990: error: 'Drawable' has not been declared
        /usr/include/tkDecls.h:990: error: 'GC' is not a type
        /usr/include/tkDecls.h:991: error: 'GC' is not a type
        /usr/include/tkDecls.h:991: error: 'Drawable' has not been declared
        /usr/include/tkDecls.h:992: error: 'Display' has not been declared
        /usr/include/tkDecls.h:992: error: 'Drawable' has not been declared
        /usr/include/tkDecls.h:992: error: 'GC' is not a type
        /usr/include/tkDecls.h:993: error: 'Drawable' has not been declared
        /usr/include/tkDecls.h:993: error: 'XPoint' has not been declared
        /usr/include/tkDecls.h:994: error: 'Drawable' has not been declared
        /usr/include/tkDecls.h:996: error: expected identifier before '*' token
        /usr/include/tkDecls.h:996: error: 'Font' declared as function returning a function
        /usr/include/tkDecls.h:998: error: 'Display' has not been declared
        /usr/include/tkDecls.h:998: error: 'Pixmap' has not been declared
        /usr/include/tkDecls.h:999: error: 'XColor' has not been declared
        /usr/include/tkDecls.h:1000: error: 'Display' has not been declared
        /usr/include/tkDecls.h:1000: error: 'Colormap' has not been declared
        /usr/include/tkDecls.h:1001: error: 'Display' has not been declared
        /usr/include/tkDecls.h:1003: error: 'Display' has not been declared
        /usr/include/tkDecls.h:1003: error: 'GC' is not a type
        /usr/include/tkDecls.h:1005: error: 'Display' has not been declared
        /usr/include/tkDecls.h:1006: error: 'Display' has not been declared
        /usr/include/tkDecls.h:1006: error: 'Pixmap' has not been declared
        /usr/include/tkDecls.h:1008: error: 'Display' has not been declared
        /usr/include/tkDecls.h:1008: error: 'XID' has not been declared
        /usr/include/tkDecls.h:1009: error: expected identifier before '*' token
        /usr/include/tkDecls.h:1009: error: 'XColor' has not been declared
        /usr/include/tkDecls.h:1009: error: 'Drawable' has not been declared
        /usr/include/tkDecls.h:1009: error: 'GC' declared as function returning a function
        /usr/include/tkDecls.h:1009: error: 'int TkStubs::GC(int*)' cannot be overloaded
        /usr/include/tkDecls.h:933: error: with 'int TkStubs::GC(int*)'
        /usr/include/tkDecls.h:1014: error: 'Atom' has not been declared
        /usr/include/tkDecls.h:1016: error: expected identifier before '*' token
        /usr/include/tkDecls.h:1016: error: 'Pixmap' declared as function returning a function
        /usr/include/tkDecls.h:1017: error: expected identifier before '*' token
        /usr/include/tkDecls.h:1017: error: 'Pixmap' declared as function returning a function
        /usr/include/tkDecls.h:1017: error: 'int TkStubs::Pixmap(int*)' cannot be overloaded
        /usr/include/tkDecls.h:1016: error: with 'int TkStubs::Pixmap(int*)'
        /usr/include/tkDecls.h:1019: error: expected ';' before '*' token
        /usr/include/tkDecls.h:1020: error: expected ';' before '*' token
        /usr/include/tkDecls.h:1021: error: expected identifier before '*' token
        /usr/include/tkDecls.h:1021: error: 'Colormap' declared as function returning a function
        /usr/include/tkDecls.h:1027: error: expected identifier before '*' token
        /usr/include/tkDecls.h:1027: error: 'XGCValues' has not been declared
        /usr/include/tkDecls.h:1027: error: 'GC' declared as function returning a function
        /usr/include/tkDecls.h:1027: error: 'int TkStubs::GC(int*)' cannot be overloaded
        /usr/include/tkDecls.h:933: error: with 'int TkStubs::GC(int*)'
        /usr/include/tkDecls.h:1036: error: expected identifier before '*' token
        /usr/include/tkDecls.h:1036: error: 'Display' has not been declared
        /usr/include/tkDecls.h:1036: error: 'Drawable' has not been declared
        /usr/include/tkDecls.h:1036: error: 'Pixmap' declared as function returning a function
        /usr/include/tkDecls.h:1036: error: 'int TkStubs::Pixmap(int*)' cannot be overloaded
        /usr/include/tkDecls.h:1016: error: with 'int TkStubs::Pixmap(int*)'
        /usr/include/tkDecls.h:1041: error: 'Atom' has not been declared
        /usr/include/tkDecls.h:1041: error: 'Atom' has not been declared
        /usr/include/tkDecls.h:1043: error: expected ';' before '*' token
        /usr/include/tkDecls.h:1046: error: 'XEvent' has not been declared
        /usr/include/tkDecls.h:1047: error: 'Display' has not been declared
        /usr/include/tkDecls.h:1050: error: expected identifier before '*' token
        /usr/include/tkDecls.h:1050: error: 'Atom' declared as function returning a function
        /usr/include/tkDecls.h:1063: error: expected ';' before '(' token
        /usr/include/tkDecls.h:1065: error: expected ';' before '(' token
        /usr/include/tkDecls.h:1066: error: expected ';' before '(' token
        /usr/include/tkDecls.h:1073: error: 'Atom' is not a type
        /usr/include/tkDecls.h:1084: error: 'Display' has not been declared
        /usr/include/tkDecls.h:1084: error: 'Colormap' is not a type
        /usr/include/tkDecls.h:1085: error: 'XEvent' has not been declared
        /usr/include/tkDecls.h:1086: error: 'Drawable' has not been declared
        /usr/include/tkDecls.h:1097: error: 'Pixmap' is not a type
        /usr/include/tkDecls.h:1100: error: 'Pixmap' is not a type
        /usr/include/tkDecls.h:1101: error: 'Colormap' is not a type
        /usr/include/tkDecls.h:1102: error: 'Visual' has not been declared
        /usr/include/tkDecls.h:1102: error: 'Colormap' is not a type
        /usr/include/tkDecls.h:1103: error: 'Display' has not been declared
        /usr/include/tkDecls.h:1103: error: 'Pixmap' is not a type
        /usr/include/tkDecls.h:1109: error: 'Display' has not been declared
        /usr/include/tkDecls.h:1109: error: 'Drawable' has not been declared
        /usr/include/tkDecls.h:1109: error: 'GC' is not a type
        /usr/include/tkDecls.h:1110: error: 'Display' has not been declared
        /usr/include/tkDecls.h:1110: error: 'Drawable' has not been declared
        /usr/include/tkDecls.h:1110: error: 'GC' is not a type
        /usr/include/tkDecls.h:1116: error: expected identifier before '*' token
        /usr/include/tkDecls.h:1116: error: 'Pixmap' declared as function returning a function
        /usr/include/tkDecls.h:1116: error: 'int TkStubs::Pixmap(int*)' cannot be overloaded
        /usr/include/tkDecls.h:1016: error: with 'int TkStubs::Pixmap(int*)'
        /usr/include/tkDecls.h:1118: error: expected ';' before '*' token
        /usr/include/tkDecls.h:1132: error: expected identifier before '*' token
        /usr/include/tkDecls.h:1132: error: 'Pixmap' declared as function returning a function
        /usr/include/tkDecls.h:1132: error: 'int TkStubs::Pixmap(int*)' cannot be overloaded
        /usr/include/tkDecls.h:1016: error: with 'int TkStubs::Pixmap(int*)'
        /usr/include/tkDecls.h:1133: error: expected ';' before '*' token
        /usr/include/tkDecls.h:1153: error: 'Display' has not been declared
        /usr/include/tkDecls.h:1154: error: 'XGCValues' has not been declared
        /usr/include/tkDecls.h:1158: error: 'GC' is not a type
        /usr/include/tkDecls.h:1160: error: 'GC' is not a type
        /usr/include/tkDecls.h:1162: error: 'Pixmap' is not a type
        /usr/include/tkDecls.h:1163: error: 'XColor' has not been declared
        /usr/include/tkDecls.h:1167: error: 'Pixmap' is not a type
        /usr/include/tkDecls.h:1179: error: 'Display' has not been declared
        /usr/include/tkDecls.h:1195: error: 'Drawable' has not been declared
        utils/TkCximage/src/TkCximage.h:155: error: 'Display' has not been declared
        utils/TkCximage/src/TkCximage.h:155: error: 'Drawable' has not been declared
        make: *** [utils/TkCximage/src/TkCximage.cpp.o] Erreur 1
        


        Comment vérifié l'état du programme ?
        1. Contributeur
          Bonjour,

          Problème d'installation résolu en installant paquetage Xlib.h