Probleme avec QT [Fermé]

Signaler
Messages postés
23
Date d'inscription
mardi 2 août 2016
Statut
Membre
Dernière intervention
30 octobre 2017
-
bonsoir chères amis je dois rendre un projet la semaine prochaine et je rencontre un gros problème dont je connais pas la source pouvez vous m'aidez.

quand je lance mon projet sur QT voila ce que ça m'affiche:


00:51:23: Exécution des étapes pour le projet testop...
00:51:23: Configuration inchangée, étape qmake sautée.
00:51:23: Débute : "C:\Qt\Tools\QtCreator\bin\jom.exe"
C:\Qt\Tools\QtCreator\bin\jom.exe -f Makefile.Debug
cl -c -nologo -Zc:wchar_t -FS -Zi -MDd -GR -W3 -w34100 -w34189 -w44996 -EHsc /Fddebug\testop.pdb -DUNICODE -DWIN32 -DWIN64 -DQT_QML_DEBUG -DQT_WIDGETS_LIB -DQT_GUI_LIB -DQT_CORE_LIB -I..\testop -I. -I..\..\..\..\Qt\5.7\msvc2013_64\include -I..\..\..\..\Qt\5.7\msvc2013_64\include\QtWidgets -I..\..\..\..\Qt\5.7\msvc2013_64\include\QtGui -I..\..\..\..\Qt\5.7\msvc2013_64\include\QtANGLE -I..\..\..\..\Qt\5.7\msvc2013_64\include\QtCore -Idebug -I..\..\..\..\Qt\5.7\msvc2013_64\mkspecs\win32-msvc2013 -Fodebug\ @C:\Users\MELO\AppData\Local\Temp\mafentre.obj.5320.32.jom
mafentre.cpp
link /NOLOGO /DYNAMICBASE /NXCOMPAT /DEBUG /SUBSYSTEM:WINDOWS "/MANIFESTDEPENDENCY:type='win32' name='Microsoft.Windows.Common-Controls' version='6.0.0.0' publicKeyToken='6595b64144ccf1df' language='*' processorArchitecture='*'" /MANIFEST:embed /OUT:debug\testop.exe @C:\Users\MELO\AppData\Local\Temp\testop.exe.5320.2547.jom
mafentre.obj : error LNK2001: symbole externe non résolu "public: virtual struct QMetaObject const * __cdecl MaFenetre::metaObject(void)const " (?metaObject@MaFenetre@@UEBAPEBUQMetaObject@@XZ)
mafentre.obj : error LNK2001: symbole externe non résolu "public: virtual void * __cdecl MaFenetre::qt_metacast(char const *)" (?qt_metacast@MaFenetre@@UEAAPEAXPEBD@Z)
mafentre.obj : error LNK2001: symbole externe non résolu "public: virtual int __cdecl MaFenetre::qt_metacall(enum QMetaObject::Call,int,void * *)" (?qt_metacall@MaFenetre@@UEAAHW4Call@QMetaObject@@HPEAPEAX@Z)
debug\testop.exe : fatal error LNK1120: 3 externes non résolus
jom: C:\Users\MELO\Documents\build-testop-Desktop_Qt_5_7_0_MSVC2013_64bit-Debug\Makefile.Debug [debug\testop.exe] Error 1120
jom: C:\Users\MELO\Documents\build-testop-Desktop_Qt_5_7_0_MSVC2013_64bit-Debug\Makefile [debug] Error 2
00:51:26: Le processus "C:\Qt\Tools\QtCreator\bin\jom.exe" s'est terminé avec le code 2.
Erreur lors de la compilation/déploiement du projet testop (kit : Desktop Qt 5.7.0 MSVC2013 64bit)
The kit Desktop Qt 5.7.0 MSVC2013 64bit has configuration issues which might be the root cause for this problem.
When executing step "Make"
00:51:26: Temps écoulé : 00:03.



merci d'avance